Skip to content

Console Output

Started by user Matthias Mueller
Checking out git ssh://git@bitbucket.aiticon.net:7999/ac/appng-build.git into /var/lib/jenkins/workspace/appNG_Authentication_Release@script/bdbfa27d130baca2dd7179d7d303b2bdc98981d2af9b10e35d0fc15e52514b80 to read build-application.jenkins
Selected Git installation does not exist. Using Default
The recommended git tool is: NONE
using credential 7212ca60-dbd7-4a0f-9f8e-b6bc3d3993d4
 > git rev-parse --resolve-git-dir /var/lib/jenkins/workspace/appNG_Authentication_Release@script/bdbfa27d130baca2dd7179d7d303b2bdc98981d2af9b10e35d0fc15e52514b80/.git # timeout=10
Fetching changes from the remote Git repository
 > git config remote.origin.url ssh://git@bitbucket.aiticon.net:7999/ac/appng-build.git # timeout=10
Cleaning workspace
 > git rev-parse --verify HEAD # timeout=10
Resetting working tree
 > git reset --hard # timeout=10
 > git clean -fdx # timeout=10
Fetching upstream changes from ssh://git@bitbucket.aiticon.net:7999/ac/appng-build.git
 > git --version # timeout=10
 > git --version # 'git version 2.30.2'
using GIT_SSH to set credentials 
Verifying host key using known hosts file
 > git fetch --tags --force --progress -- ssh://git@bitbucket.aiticon.net:7999/ac/appng-build.git +refs/heads/*:refs/remotes/origin/* # timeout=10
 > git rev-parse refs/remotes/origin/master^{commit} # timeout=10
Checking out Revision 75ed061924d906a09eed3558b96c26e06761dd62 (refs/remotes/origin/master)
 > git config core.sparsecheckout # timeout=10
 > git checkout -f 75ed061924d906a09eed3558b96c26e06761dd62 # timeout=10
Commit message: "build-application.jenkins edited online with Bitbucket"
 > git rev-list --no-walk 75ed061924d906a09eed3558b96c26e06761dd62 # timeout=10
[Pipeline] Start of Pipeline
[Pipeline] node
Running on Jenkins in /var/lib/jenkins/workspace/appNG_Authentication_Release
[Pipeline] {
[Pipeline] tool
[Pipeline] tool
[Pipeline] stage
[Pipeline] { (Info)
[Pipeline] echo
##############################################
[Pipeline] echo
Preparing release 1.14.0 for appng-authentication from branch appng-authentication-1.14.x, current snapshot is 1.14.0-SNAPSHOT, next version will be 1.14.1-SNAPSHOT
[Pipeline] echo
##############################################
[Pipeline] }
[Pipeline] // stage
[Pipeline] stage
[Pipeline] { (Prepare Release Branch)
[Pipeline] sh
+ rm -rf appng-authentication
[Pipeline] sh
+ git clone git@github.com:appNG/appng-authentication.git appng-authentication
Cloning into 'appng-authentication'...
[Pipeline] dir
Running in /var/lib/jenkins/workspace/appNG_Authentication_Release/appng-authentication
[Pipeline] {
[Pipeline] sh
+ git checkout appng-authentication-1.14.x
Switched to a new branch 'appng-authentication-1.14.x'
Branch 'appng-authentication-1.14.x' set up to track remote branch 'appng-authentication-1.14.x' from 'origin'.
[Pipeline] sh
+ sed -i s/1\.14\.0-SNAPSHOT/1\.14\.0/g pom.xml
[Pipeline] sh
+ git status
On branch appng-authentication-1.14.x
Your branch is up to date with 'origin/appng-authentication-1.14.x'.

Changes not staged for commit:
  (use "git add <file>..." to update what will be committed)
  (use "git restore <file>..." to discard changes in working directory)
	modified:   pom.xml

no changes added to commit (use "git add" and/or "git commit -a")
[Pipeline] sh
+ git commit -a -m preparing release 1.14.0
[appng-authentication-1.14.x 4a964fe] preparing release 1.14.0
 1 file changed, 1 insertion(+), 1 deletion(-)
[Pipeline] }
[Pipeline] // dir
[Pipeline] }
[Pipeline] // stage
[Pipeline] stage
[Pipeline] { (Build Release Branch)
[Pipeline] dir
Running in /var/lib/jenkins/workspace/appNG_Authentication_Release/appng-authentication
[Pipeline] {
[Pipeline] sh
+ /var/lib/jenkins/tools/hudson.tasks.Maven_MavenInstallation/Maven_3.6.3/bin/mvn -version
Apache Maven 3.8.6 (84538c9988a25aec085021c365c560670ad80f63)
Maven home: /var/lib/jenkins/tools/hudson.tasks.Maven_MavenInstallation/Maven_3.6.3
Java version: 17.0.6, vendor: Eclipse Adoptium, runtime: /var/lib/jenkins/tools/hudson.model.JDK/OpenJDK17/jdk-17.0.6+10
Default locale: en_US, platform encoding: UTF-8
OS name: "linux", version: "5.10.0-19-amd64", arch: "amd64", family: "unix"
[Pipeline] sh
+ /var/lib/jenkins/tools/hudson.tasks.Maven_MavenInstallation/Maven_3.6.3/bin/mvn clean deploy -DoutFolder=/srv/www/appng.org/appng/builds/stable -Pmaven-central
[INFO] Scanning for projects...
[INFO] Inspecting build with total of 1 modules...
[INFO] Installing Nexus Staging features:
[INFO]   ... total of 1 executions of maven-deploy-plugin replaced with nexus-staging-maven-plugin
[INFO] 
[INFO] -------------------< org.appng:appng-authentication >-------------------
[INFO] Building appNG Authentication 1.14.0
[INFO] --------------------------------[ jar ]---------------------------------
[INFO] 
[INFO] --- maven-clean-plugin:2.5:clean (default-clean) @ appng-authentication ---
[INFO] 
[INFO] --- appng-maven-plugin:1.24.5:generateApplicationConstants (applicationConstants) @ appng-authentication ---
[INFO] generate application constants for [/var/lib/jenkins/workspace/appNG_Authentication_Release/appng-authentication/application-home/application.xml, org.appng.application.authentication.AuthenticationSettings, /var/lib/jenkins/workspace/appNG_Authentication_Release/appng-authentication/target/generated-sources/constants]
[INFO] 
[INFO] --- appng-maven-plugin:1.24.5:generateMessageConstants (messageConstants) @ appng-authentication ---
[INFO] generate message constants for [/var/lib/jenkins/workspace/appNG_Authentication_Release/appng-authentication/application-home/dictionary/authentication-messages.properties, org.appng.application.authentication.MessageConstants, /var/lib/jenkins/workspace/appNG_Authentication_Release/appng-authentication/target/generated-sources/constants]
[INFO] 
[INFO] --- build-helper-maven-plugin:3.0.0:add-source (default) @ appng-authentication ---
[INFO] Source directory: /var/lib/jenkins/workspace/appNG_Authentication_Release/appng-authentication/target/generated-sources/constants added.
[INFO] 
[INFO] --- maven-resources-plugin:2.6:resources (default-resources) @ appng-authentication ---
[INFO] Using 'UTF-8' encoding to copy filtered resources.
[INFO] skip non existing resourceDirectory /var/lib/jenkins/workspace/appNG_Authentication_Release/appng-authentication/src/main/resources
[INFO] 
[INFO] --- maven-compiler-plugin:3.10.1:compile (default-compile) @ appng-authentication ---
[INFO] Changes detected - recompiling the module!
[INFO] Compiling 14 source files to /var/lib/jenkins/workspace/appNG_Authentication_Release/appng-authentication/target/classes
[INFO] /var/lib/jenkins/workspace/appNG_Authentication_Release/appng-authentication/src/main/java/org/appng/application/authentication/webform/PasswordReset.java: /var/lib/jenkins/workspace/appNG_Authentication_Release/appng-authentication/src/main/java/org/appng/application/authentication/webform/PasswordReset.java uses or overrides a deprecated API.
[INFO] /var/lib/jenkins/workspace/appNG_Authentication_Release/appng-authentication/src/main/java/org/appng/application/authentication/webform/PasswordReset.java: Recompile with -Xlint:deprecation for details.
[INFO] 
[INFO] --- maven-resources-plugin:2.6:testResources (default-testResources) @ appng-authentication ---
[INFO] Using 'UTF-8' encoding to copy filtered resources.
[INFO] Copying 9 resources
[INFO] 
[INFO] --- maven-compiler-plugin:3.10.1:testCompile (default-testCompile) @ appng-authentication ---
[INFO] Changes detected - recompiling the module!
[INFO] Compiling 11 source files to /var/lib/jenkins/workspace/appNG_Authentication_Release/appng-authentication/target/test-classes
[INFO] /var/lib/jenkins/workspace/appNG_Authentication_Release/appng-authentication/src/test/java/org/appng/application/authentication/webform/PasswordResetTest.java: /var/lib/jenkins/workspace/appNG_Authentication_Release/appng-authentication/src/test/java/org/appng/application/authentication/webform/PasswordResetTest.java uses or overrides a deprecated API.
[INFO] /var/lib/jenkins/workspace/appNG_Authentication_Release/appng-authentication/src/test/java/org/appng/application/authentication/webform/PasswordResetTest.java: Recompile with -Xlint:deprecation for details.
[INFO] 
[INFO] --- maven-surefire-plugin:3.0.0-M7:test (default-test) @ appng-authentication ---
[INFO] Using auto detected provider org.apache.maven.surefire.junit4.JUnit4Provider
[INFO] 
[INFO] -------------------------------------------------------
[INFO]  T E S T S
[INFO] -------------------------------------------------------
[INFO] Running org.appng.application.authentication.digest.DigestLoginTest
Apr 11, 2023 11:01:38 AM ch.sla.jdbcperflogger.Logger info
INFO: Using config file jdbcperflogger-fallback.xml
2023-04-11 11:01:41,926 ERROR [main] org.appng.core.security.DigestValidator: Encrypted part does not match. Encrypted part is 2F8554E2C460A5712DCDC7578D76F82C, but should be C549F73D77C2B36775711DDBE4536A47
2023-04-11 11:01:41,927 ERROR [main] org.appng.core.security.DigestValidator: Digest validation failed.
[INFO] Tests run: 3, Failures: 0, Errors: 0, Skipped: 0, Time elapsed: 6.864 s - in org.appng.application.authentication.digest.DigestLoginTest
[INFO] Running org.appng.application.authentication.ntlm.NtlmLoginTest
2023-04-11 11:01:44,480 ERROR [main] org.appng.core.service.CoreService: No valid group membership found for user 'subject-42'
[WARNING] Tests run: 4, Failures: 0, Errors: 0, Skipped: 2, Time elapsed: 2.459 s - in org.appng.application.authentication.ntlm.NtlmLoginTest
[INFO] Running org.appng.application.authentication.webform.LogoutUserTest
[INFO] Tests run: 1, Failures: 0, Errors: 0, Skipped: 0, Time elapsed: 2.071 s - in org.appng.application.authentication.webform.LogoutUserTest
[INFO] Running org.appng.application.authentication.webform.LoginFormTest
[INFO] Tests run: 6, Failures: 0, Errors: 0, Skipped: 0, Time elapsed: 11.087 s - in org.appng.application.authentication.webform.LoginFormTest
[INFO] Running org.appng.application.authentication.webform.EditProfileTest
[INFO] Tests run: 1, Failures: 0, Errors: 0, Skipped: 0, Time elapsed: 2.782 s - in org.appng.application.authentication.webform.EditProfileTest
[INFO] Running org.appng.application.authentication.webform.PasswordChangeTest
[INFO] Tests run: 4, Failures: 0, Errors: 0, Skipped: 0, Time elapsed: 3.577 s - in org.appng.application.authentication.webform.PasswordChangeTest
[INFO] Running org.appng.application.authentication.webform.PasswordResetTest
[INFO] Tests run: 5, Failures: 0, Errors: 0, Skipped: 0, Time elapsed: 3.531 s - in org.appng.application.authentication.webform.PasswordResetTest
[INFO] Running org.appng.application.authentication.webform.LoginUserTest
[INFO] Tests run: 3, Failures: 0, Errors: 0, Skipped: 0, Time elapsed: 2.167 s - in org.appng.application.authentication.webform.LoginUserTest
[INFO] Running org.appng.application.authentication.BaseLoginTest
[WARNING] Tests run: 1, Failures: 0, Errors: 0, Skipped: 1, Time elapsed: 0.001 s - in org.appng.application.authentication.BaseLoginTest
[INFO] 
[INFO] Results:
[INFO] 
[WARNING] Tests run: 28, Failures: 0, Errors: 0, Skipped: 3
[INFO] 
[INFO] 
[INFO] --- maven-jar-plugin:3.0.2:jar (default-jar) @ appng-authentication ---
[INFO] Building jar: /var/lib/jenkins/workspace/appNG_Authentication_Release/appng-authentication/target/appng-authentication-1.14.0.jar
[INFO] 
[INFO] --- maven-javadoc-plugin:2.10.4:jar (generate-docs) @ appng-authentication ---
[WARNING] Javadoc Warnings
[WARNING] Loading source file /var/lib/jenkins/workspace/appNG_Authentication_Release/appng-authentication/src/main/java/org/appng/application/authentication/digest/DigestLogin.java...
[WARNING] Loading source file /var/lib/jenkins/workspace/appNG_Authentication_Release/appng-authentication/src/main/java/org/appng/application/authentication/ntlm/NtlmLogin.java...
[WARNING] Loading source file /var/lib/jenkins/workspace/appNG_Authentication_Release/appng-authentication/src/main/java/org/appng/application/authentication/AbstractLogon.java...
[WARNING] Loading source file /var/lib/jenkins/workspace/appNG_Authentication_Release/appng-authentication/src/main/java/org/appng/application/authentication/BeanConfig.java...
[WARNING] Loading source file /var/lib/jenkins/workspace/appNG_Authentication_Release/appng-authentication/src/main/java/org/appng/application/authentication/webform/PasswordChange.java...
[WARNING] Loading source file /var/lib/jenkins/workspace/appNG_Authentication_Release/appng-authentication/src/main/java/org/appng/application/authentication/webform/LogoutUser.java...
[WARNING] Loading source file /var/lib/jenkins/workspace/appNG_Authentication_Release/appng-authentication/src/main/java/org/appng/application/authentication/webform/LoginData.java...
[WARNING] Loading source file /var/lib/jenkins/workspace/appNG_Authentication_Release/appng-authentication/src/main/java/org/appng/application/authentication/webform/LoginForm.java...
[WARNING] Loading source file /var/lib/jenkins/workspace/appNG_Authentication_Release/appng-authentication/src/main/java/org/appng/application/authentication/webform/EditProfile.java...
[WARNING] Loading source file /var/lib/jenkins/workspace/appNG_Authentication_Release/appng-authentication/src/main/java/org/appng/application/authentication/webform/PasswordReset.java...
[WARNING] Loading source file /var/lib/jenkins/workspace/appNG_Authentication_Release/appng-authentication/src/main/java/org/appng/application/authentication/webform/LoginUser.java...
[WARNING] Loading source file /var/lib/jenkins/workspace/appNG_Authentication_Release/appng-authentication/src/main/java/org/appng/application/authentication/saml/SamlController.java...
[WARNING] Loading source file /var/lib/jenkins/workspace/appNG_Authentication_Release/appng-authentication/target/generated-sources/constants/org/appng/application/authentication/MessageConstants.java...
[WARNING] Loading source file /var/lib/jenkins/workspace/appNG_Authentication_Release/appng-authentication/target/generated-sources/constants/org/appng/application/authentication/AuthenticationSettings.java...
[WARNING] Constructing Javadoc information...
[WARNING] warning: The code being documented uses modules but the packages defined in http://docs.oracle.com/javase/8/docs/api/ are in the unnamed module.
[WARNING] Building index for all the packages and classes...
[WARNING] Standard Doclet version 17.0.6+10
[WARNING] Building tree for all the packages and classes...
[WARNING] Generating /var/lib/jenkins/workspace/appNG_Authentication_Release/appng-authentication/target/apidocs/org/appng/application/authentication/AbstractLogon.html...
[WARNING] /var/lib/jenkins/workspace/appNG_Authentication_Release/appng-authentication/src/main/java/org/appng/application/authentication/AbstractLogon.java:38: warning: no comment
[WARNING] public abstract class AbstractLogon implements ActionProvider<LoginData> {
[WARNING] ^
[WARNING] /var/lib/jenkins/workspace/appNG_Authentication_Release/appng-authentication/src/main/java/org/appng/application/authentication/AbstractLogon.java:48: warning: no comment
[WARNING] protected static final String ACTION_FORGOT_PASSWORD = "forgotPassword";
[WARNING] ^
[WARNING] /var/lib/jenkins/workspace/appNG_Authentication_Release/appng-authentication/src/main/java/org/appng/application/authentication/AbstractLogon.java:50: warning: no comment
[WARNING] protected static final String ACTION_LOGIN = "login";
[WARNING] ^
[WARNING] /var/lib/jenkins/workspace/appNG_Authentication_Release/appng-authentication/src/main/java/org/appng/application/authentication/AbstractLogon.java:49: warning: no comment
[WARNING] protected static final String ACTION_RESET_PASSWORD = "resetPassword";
[WARNING] ^
[WARNING] /var/lib/jenkins/workspace/appNG_Authentication_Release/appng-authentication/src/main/java/org/appng/application/authentication/AbstractLogon.java:51: warning: no comment
[WARNING] protected CoreService coreService;
[WARNING] ^
[WARNING] /var/lib/jenkins/workspace/appNG_Authentication_Release/appng-authentication/src/main/java/org/appng/application/authentication/AbstractLogon.java:42: warning: no comment
[WARNING] protected static final String PARAM_ACTION = "action";
[WARNING] ^
[WARNING] /var/lib/jenkins/workspace/appNG_Authentication_Release/appng-authentication/src/main/java/org/appng/application/authentication/AbstractLogon.java:43: warning: no comment
[WARNING] protected static final String PARAM_FORM_ACTION = "form_action";
[WARNING] ^
[WARNING] /var/lib/jenkins/workspace/appNG_Authentication_Release/appng-authentication/src/main/java/org/appng/application/authentication/AbstractLogon.java:45: warning: no comment
[WARNING] protected static final String PARAM_HASH = "hash";
[WARNING] ^
[WARNING] /var/lib/jenkins/workspace/appNG_Authentication_Release/appng-authentication/src/main/java/org/appng/application/authentication/AbstractLogon.java:44: warning: no comment
[WARNING] protected static final String PARAM_PASSWORD = "password";
[WARNING] ^
[WARNING] /var/lib/jenkins/workspace/appNG_Authentication_Release/appng-authentication/src/main/java/org/appng/application/authentication/AbstractLogon.java:46: warning: no comment
[WARNING] protected static final String PARAM_USERNAME = "username";
[WARNING] ^
[WARNING] /var/lib/jenkins/workspace/appNG_Authentication_Release/appng-authentication/src/main/java/org/appng/application/authentication/AbstractLogon.java:40: warning: no comment
[WARNING] public static final String PRE_LOGIN_PATH = "preLoginPath";
[WARNING] ^
[WARNING] /var/lib/jenkins/workspace/appNG_Authentication_Release/appng-authentication/src/main/java/org/appng/application/authentication/AbstractLogon.java:53: warning: no comment
[WARNING] protected AbstractLogon(CoreService coreService) {
[WARNING] ^
[WARNING] /var/lib/jenkins/workspace/appNG_Authentication_Release/appng-authentication/src/main/java/org/appng/application/authentication/AbstractLogon.java:121: warning: no comment
[WARNING] public static String getSuccessPage(Properties applicationProps, boolean useGroups, List<String> groupNames) {
[WARNING] ^
[WARNING] /var/lib/jenkins/workspace/appNG_Authentication_Release/appng-authentication/src/main/java/org/appng/application/authentication/AbstractLogon.java:139: warning: no comment
[WARNING] public boolean isSubjectLoggedIn(Environment env) {
[WARNING] ^
[WARNING] /var/lib/jenkins/workspace/appNG_Authentication_Release/appng-authentication/src/main/java/org/appng/application/authentication/AbstractLogon.java:143: warning: no comment
[WARNING] protected abstract Logger log();
[WARNING] ^
[WARNING] /var/lib/jenkins/workspace/appNG_Authentication_Release/appng-authentication/src/main/java/org/appng/application/authentication/AbstractLogon.java:112: warning: no comment
[WARNING] protected void processLogonResult(Site site, Application application, Environment env, Options options,
[WARNING] ^
[WARNING] /var/lib/jenkins/workspace/appNG_Authentication_Release/appng-authentication/src/main/java/org/appng/application/authentication/AbstractLogon.java:57: warning: no comment
[WARNING] protected void processLogonResult(Site site, Application application, Environment env, Options options,
[WARNING] ^
[WARNING] /var/lib/jenkins/workspace/appNG_Authentication_Release/appng-authentication/src/main/java/org/appng/application/authentication/AbstractLogon.java:64: warning: no comment
[WARNING] protected void processLogonResult(Site site, Application application, Environment env, Options options,
[WARNING] ^
[WARNING] Generating /var/lib/jenkins/workspace/appNG_Authentication_Release/appng-authentication/target/apidocs/org/appng/application/authentication/AuthenticationSettings.html...
[WARNING] Generating /var/lib/jenkins/workspace/appNG_Authentication_Release/appng-authentication/target/apidocs/org/appng/application/authentication/BeanConfig.html...
[WARNING] /var/lib/jenkins/workspace/appNG_Authentication_Release/appng-authentication/src/main/java/org/appng/application/authentication/BeanConfig.java:11: warning: no comment
[WARNING] public class BeanConfig {
[WARNING] ^
[WARNING] /var/lib/jenkins/workspace/appNG_Authentication_Release/appng-authentication/src/main/java/org/appng/application/authentication/BeanConfig.java:14: warning: no comment
[WARNING] public ByteArrayHttpMessageConverter byteArrayHttpMessageConverter() {
[WARNING] ^
[WARNING] /var/lib/jenkins/workspace/appNG_Authentication_Release/appng-authentication/src/main/java/org/appng/application/authentication/BeanConfig.java:19: warning: no comment
[WARNING] public StringHttpMessageConverter stringHttpMessageConverter() {
[WARNING] ^
[WARNING] Generating /var/lib/jenkins/workspace/appNG_Authentication_Release/appng-authentication/target/apidocs/org/appng/application/authentication/digest/DigestLogin.html...
[WARNING] /var/lib/jenkins/workspace/appNG_Authentication_Release/appng-authentication/src/main/java/org/appng/application/authentication/digest/DigestLogin.java:52: warning: no comment
[WARNING] public DigestLogin(CoreService coreService) {
[WARNING] ^
[WARNING] Generating /var/lib/jenkins/workspace/appNG_Authentication_Release/appng-authentication/target/apidocs/org/appng/application/authentication/webform/EditProfile.html...
[WARNING] /var/lib/jenkins/workspace/appNG_Authentication_Release/appng-authentication/src/main/java/org/appng/application/authentication/webform/EditProfile.java:57: warning: no comment
[WARNING] public class EditProfile implements ActionProvider<SubjectImpl>, DataProvider {
[WARNING] ^
[WARNING] /var/lib/jenkins/workspace/appNG_Authentication_Release/appng-authentication/src/main/java/org/appng/application/authentication/webform/EditProfile.java:61: warning: no comment
[WARNING] public EditProfile(CoreService coreService) {
[WARNING] ^
[WARNING] Generating /var/lib/jenkins/workspace/appNG_Authentication_Release/appng-authentication/target/apidocs/org/appng/application/authentication/webform/LoginData.html...
[WARNING] /var/lib/jenkins/workspace/appNG_Authentication_Release/appng-authentication/src/main/java/org/appng/application/authentication/webform/LoginData.java:26: warning: no comment
[WARNING] public class LoginData {
[WARNING] ^
[WARNING] /var/lib/jenkins/workspace/appNG_Authentication_Release/appng-authentication/src/main/java/org/appng/application/authentication/webform/LoginData.java:56: warning: no comment
[WARNING] public String getDigest() {
[WARNING] ^
[WARNING] /var/lib/jenkins/workspace/appNG_Authentication_Release/appng-authentication/src/main/java/org/appng/application/authentication/webform/LoginData.java:41: warning: no comment
[WARNING] public String getOldpassword() {
[WARNING] ^
[WARNING] /var/lib/jenkins/workspace/appNG_Authentication_Release/appng-authentication/src/main/java/org/appng/application/authentication/webform/LoginData.java:47: warning: no comment
[WARNING] public String getPassword() {
[WARNING] ^
[WARNING] /var/lib/jenkins/workspace/appNG_Authentication_Release/appng-authentication/src/main/java/org/appng/application/authentication/webform/LoginData.java:52: warning: no comment
[WARNING] public String getPasswordConfirmation() {
[WARNING] ^
[WARNING] /var/lib/jenkins/workspace/appNG_Authentication_Release/appng-authentication/src/main/java/org/appng/application/authentication/webform/LoginData.java:36: warning: no comment
[WARNING] public String getUsername() {
[WARNING] ^
[WARNING] Generating /var/lib/jenkins/workspace/appNG_Authentication_Release/appng-authentication/target/apidocs/org/appng/application/authentication/webform/LoginForm.html...
[WARNING] /var/lib/jenkins/workspace/appNG_Authentication_Release/appng-authentication/src/main/java/org/appng/application/authentication/webform/LoginForm.java:52: warning: no comment
[WARNING] public class LoginForm implements DataProvider {
[WARNING] ^
[WARNING] Generating /var/lib/jenkins/workspace/appNG_Authentication_Release/appng-authentication/target/apidocs/org/appng/application/authentication/webform/LoginUser.html...
[WARNING] /var/lib/jenkins/workspace/appNG_Authentication_Release/appng-authentication/src/main/java/org/appng/application/authentication/webform/LoginUser.java:41: warning: no comment
[WARNING] public LoginUser(CoreService coreService) {
[WARNING] ^
[WARNING] Generating /var/lib/jenkins/workspace/appNG_Authentication_Release/appng-authentication/target/apidocs/org/appng/application/authentication/webform/LogoutUser.html...
[WARNING] /var/lib/jenkins/workspace/appNG_Authentication_Release/appng-authentication/src/main/java/org/appng/application/authentication/webform/LogoutUser.java:48: warning: no comment
[WARNING] public LogoutUser(CoreService coreService, SamlController samlController) {
[WARNING] ^
[WARNING] Generating /var/lib/jenkins/workspace/appNG_Authentication_Release/appng-authentication/target/apidocs/org/appng/application/authentication/MessageConstants.html...
[WARNING] /var/lib/jenkins/workspace/appNG_Authentication_Release/appng-authentication/target/generated-sources/constants/org/appng/application/authentication/MessageConstants.java:3: warning: no comment
[WARNING] public class MessageConstants {
[WARNING] ^
[WARNING] Generating /var/lib/jenkins/workspace/appNG_Authentication_Release/appng-authentication/target/apidocs/org/appng/application/authentication/ntlm/NtlmLogin.html...
[WARNING] /var/lib/jenkins/workspace/appNG_Authentication_Release/appng-authentication/src/main/java/org/appng/application/authentication/ntlm/NtlmLogin.java:45: warning: no comment
[WARNING] protected NtlmLogin(CoreService coreService) {
[WARNING] ^
[WARNING] Generating /var/lib/jenkins/workspace/appNG_Authentication_Release/appng-authentication/target/apidocs/org/appng/application/authentication/webform/PasswordChange.html...
[WARNING] /var/lib/jenkins/workspace/appNG_Authentication_Release/appng-authentication/src/main/java/org/appng/application/authentication/webform/PasswordChange.java:60: warning: no comment
[WARNING] public class PasswordChange extends AbstractLogon implements DataProvider {
[WARNING] ^
[WARNING] /var/lib/jenkins/workspace/appNG_Authentication_Release/appng-authentication/src/main/java/org/appng/application/authentication/webform/PasswordChange.java:66: warning: no comment
[WARNING] public PasswordChange(CoreService coreService) {
[WARNING] ^
[WARNING] Generating /var/lib/jenkins/workspace/appNG_Authentication_Release/appng-authentication/target/apidocs/org/appng/application/authentication/webform/PasswordReset.html...
[WARNING] /var/lib/jenkins/workspace/appNG_Authentication_Release/appng-authentication/src/main/java/org/appng/application/authentication/webform/PasswordReset.java:54: warning: no comment
[WARNING] public class PasswordReset extends AbstractLogon {
[WARNING] ^
[WARNING] /var/lib/jenkins/workspace/appNG_Authentication_Release/appng-authentication/src/main/java/org/appng/application/authentication/webform/PasswordReset.java:58: warning: no comment
[WARNING] public PasswordReset(CoreService coreService) {
[WARNING] ^
[WARNING] /var/lib/jenkins/workspace/appNG_Authentication_Release/appng-authentication/src/main/java/org/appng/application/authentication/webform/PasswordReset.java:78: warning: no comment
[WARNING] protected boolean doReset(Site site, Application application, Environment environment, Request request,
[WARNING] ^
[WARNING] /var/lib/jenkins/workspace/appNG_Authentication_Release/appng-authentication/src/main/java/org/appng/application/authentication/webform/PasswordReset.java:157: warning: no comment
[WARNING] protected String getMessageForgotPassword(Application application, AuthSubject authSubject, Locale locale,
[WARNING] ^
[WARNING] /var/lib/jenkins/workspace/appNG_Authentication_Release/appng-authentication/src/main/java/org/appng/application/authentication/webform/PasswordReset.java:163: warning: no comment
[WARNING] protected String getMessageResetPassword(Application application, AuthSubject authSubject, Locale locale,
[WARNING] ^
[WARNING] Generating /var/lib/jenkins/workspace/appNG_Authentication_Release/appng-authentication/target/apidocs/org/appng/application/authentication/saml/SamlController.html...
[WARNING] /var/lib/jenkins/workspace/appNG_Authentication_Release/appng-authentication/src/main/java/org/appng/application/authentication/saml/SamlController.java:101: warning: no comment
[WARNING] public static String CLAIM = "http://schemas.xmlsoap.org/ws/2005/05/identity/claims/";
[WARNING] ^
[WARNING] /var/lib/jenkins/workspace/appNG_Authentication_Release/appng-authentication/src/main/java/org/appng/application/authentication/saml/SamlController.java:270: warning: no comment
[WARNING] public String getEndpoint() {
[WARNING] ^
[WARNING] /var/lib/jenkins/workspace/appNG_Authentication_Release/appng-authentication/src/main/java/org/appng/application/authentication/saml/SamlController.java:274: warning: no comment
[WARNING] public String getLogoutPath() {
[WARNING] ^
[WARNING] /var/lib/jenkins/workspace/appNG_Authentication_Release/appng-authentication/src/main/java/org/appng/application/authentication/saml/SamlController.java:266: warning: no comment
[WARNING] public boolean isEnabled() {
[WARNING] ^
[WARNING] /var/lib/jenkins/workspace/appNG_Authentication_Release/appng-authentication/src/main/java/org/appng/application/authentication/saml/SamlController.java:121: warning: no comment
[WARNING] public void login(HttpServletResponse response) throws IOException, SamlException {
[WARNING] ^
[WARNING] /var/lib/jenkins/workspace/appNG_Authentication_Release/appng-authentication/src/main/java/org/appng/application/authentication/saml/SamlController.java:234: warning: no comment
[WARNING] public ResponseEntity<Void> logout(HttpServletRequest request, Environment environment) {
[WARNING] ^
[WARNING] /var/lib/jenkins/workspace/appNG_Authentication_Release/appng-authentication/src/main/java/org/appng/application/authentication/saml/SamlController.java:253: warning: no comment
[WARNING] public void logout(HttpServletResponse response) {
[WARNING] ^
[WARNING] /var/lib/jenkins/workspace/appNG_Authentication_Release/appng-authentication/src/main/java/org/appng/application/authentication/saml/SamlController.java:279: warning: no comment
[WARNING] public void logout(Environment environment) {
[WARNING] ^
[WARNING] /var/lib/jenkins/workspace/appNG_Authentication_Release/appng-authentication/src/main/java/org/appng/application/authentication/saml/SamlController.java:130: warning: no comment
[WARNING] public ResponseEntity<Void> reply(HttpServletRequest request, Environment environment) {
[WARNING] ^
[WARNING] /var/lib/jenkins/workspace/appNG_Authentication_Release/appng-authentication/src/main/java/org/appng/application/authentication/saml/SamlController.java:226: warning: no comment
[WARNING] public ResponseEntity<String> signOn(@RequestBody String payload) {
[WARNING] ^
[WARNING] Generating /var/lib/jenkins/workspace/appNG_Authentication_Release/appng-authentication/target/apidocs/org/appng/application/authentication/package-summary.html...
[WARNING] Generating /var/lib/jenkins/workspace/appNG_Authentication_Release/appng-authentication/target/apidocs/org/appng/application/authentication/package-tree.html...
[WARNING] Generating /var/lib/jenkins/workspace/appNG_Authentication_Release/appng-authentication/target/apidocs/org/appng/application/authentication/digest/package-summary.html...
[WARNING] Generating /var/lib/jenkins/workspace/appNG_Authentication_Release/appng-authentication/target/apidocs/org/appng/application/authentication/digest/package-tree.html...
[WARNING] Generating /var/lib/jenkins/workspace/appNG_Authentication_Release/appng-authentication/target/apidocs/org/appng/application/authentication/ntlm/package-summary.html...
[WARNING] Generating /var/lib/jenkins/workspace/appNG_Authentication_Release/appng-authentication/target/apidocs/org/appng/application/authentication/ntlm/package-tree.html...
[WARNING] Generating /var/lib/jenkins/workspace/appNG_Authentication_Release/appng-authentication/target/apidocs/org/appng/application/authentication/saml/package-summary.html...
[WARNING] Generating /var/lib/jenkins/workspace/appNG_Authentication_Release/appng-authentication/target/apidocs/org/appng/application/authentication/saml/package-tree.html...
[WARNING] Generating /var/lib/jenkins/workspace/appNG_Authentication_Release/appng-authentication/target/apidocs/org/appng/application/authentication/webform/package-summary.html...
[WARNING] Generating /var/lib/jenkins/workspace/appNG_Authentication_Release/appng-authentication/target/apidocs/org/appng/application/authentication/webform/package-tree.html...
[WARNING] Generating /var/lib/jenkins/workspace/appNG_Authentication_Release/appng-authentication/target/apidocs/constant-values.html...
[WARNING] Generating /var/lib/jenkins/workspace/appNG_Authentication_Release/appng-authentication/target/apidocs/org/appng/application/authentication/digest/class-use/DigestLogin.html...
[WARNING] Generating /var/lib/jenkins/workspace/appNG_Authentication_Release/appng-authentication/target/apidocs/org/appng/application/authentication/ntlm/class-use/NtlmLogin.html...
[WARNING] Generating /var/lib/jenkins/workspace/appNG_Authentication_Release/appng-authentication/target/apidocs/org/appng/application/authentication/class-use/AbstractLogon.html...
[WARNING] Generating /var/lib/jenkins/workspace/appNG_Authentication_Release/appng-authentication/target/apidocs/org/appng/application/authentication/class-use/BeanConfig.html...
[WARNING] Generating /var/lib/jenkins/workspace/appNG_Authentication_Release/appng-authentication/target/apidocs/org/appng/application/authentication/webform/class-use/PasswordChange.html...
[WARNING] Generating /var/lib/jenkins/workspace/appNG_Authentication_Release/appng-authentication/target/apidocs/org/appng/application/authentication/webform/class-use/LogoutUser.html...
[WARNING] Generating /var/lib/jenkins/workspace/appNG_Authentication_Release/appng-authentication/target/apidocs/org/appng/application/authentication/webform/class-use/LoginData.html...
[WARNING] Generating /var/lib/jenkins/workspace/appNG_Authentication_Release/appng-authentication/target/apidocs/org/appng/application/authentication/webform/class-use/LoginForm.html...
[WARNING] Generating /var/lib/jenkins/workspace/appNG_Authentication_Release/appng-authentication/target/apidocs/org/appng/application/authentication/webform/class-use/EditProfile.html...
[WARNING] Generating /var/lib/jenkins/workspace/appNG_Authentication_Release/appng-authentication/target/apidocs/org/appng/application/authentication/webform/class-use/PasswordReset.html...
[WARNING] Generating /var/lib/jenkins/workspace/appNG_Authentication_Release/appng-authentication/target/apidocs/org/appng/application/authentication/webform/class-use/LoginUser.html...
[WARNING] Generating /var/lib/jenkins/workspace/appNG_Authentication_Release/appng-authentication/target/apidocs/org/appng/application/authentication/saml/class-use/SamlController.html...
[WARNING] Generating /var/lib/jenkins/workspace/appNG_Authentication_Release/appng-authentication/target/apidocs/org/appng/application/authentication/class-use/MessageConstants.html...
[WARNING] Generating /var/lib/jenkins/workspace/appNG_Authentication_Release/appng-authentication/target/apidocs/org/appng/application/authentication/class-use/AuthenticationSettings.html...
[WARNING] Generating /var/lib/jenkins/workspace/appNG_Authentication_Release/appng-authentication/target/apidocs/org/appng/application/authentication/package-use.html...
[WARNING] Generating /var/lib/jenkins/workspace/appNG_Authentication_Release/appng-authentication/target/apidocs/org/appng/application/authentication/digest/package-use.html...
[WARNING] Generating /var/lib/jenkins/workspace/appNG_Authentication_Release/appng-authentication/target/apidocs/org/appng/application/authentication/ntlm/package-use.html...
[WARNING] Generating /var/lib/jenkins/workspace/appNG_Authentication_Release/appng-authentication/target/apidocs/org/appng/application/authentication/saml/package-use.html...
[WARNING] Generating /var/lib/jenkins/workspace/appNG_Authentication_Release/appng-authentication/target/apidocs/org/appng/application/authentication/webform/package-use.html...
[WARNING] Generating /var/lib/jenkins/workspace/appNG_Authentication_Release/appng-authentication/target/apidocs/overview-tree.html...
[WARNING] Generating /var/lib/jenkins/workspace/appNG_Authentication_Release/appng-authentication/target/apidocs/index.html...
[WARNING] Building index for all classes...
[WARNING] Generating /var/lib/jenkins/workspace/appNG_Authentication_Release/appng-authentication/target/apidocs/allclasses-index.html...
[WARNING] Generating /var/lib/jenkins/workspace/appNG_Authentication_Release/appng-authentication/target/apidocs/allpackages-index.html...
[WARNING] Generating /var/lib/jenkins/workspace/appNG_Authentication_Release/appng-authentication/target/apidocs/index-all.html...
[WARNING] Generating /var/lib/jenkins/workspace/appNG_Authentication_Release/appng-authentication/target/apidocs/overview-summary.html...
[WARNING] Generating /var/lib/jenkins/workspace/appNG_Authentication_Release/appng-authentication/target/apidocs/help-doc.html...
[WARNING] 53 warnings
[INFO] Building jar: /var/lib/jenkins/workspace/appNG_Authentication_Release/appng-authentication/target/appng-authentication-1.14.0-javadoc.jar
[INFO] 
[INFO] --- maven-assembly-plugin:3.0.0:single (default) @ appng-authentication ---
[INFO] Building zip: /srv/www/appng.org/appng/builds/stable/appng-authentication-1.14.0-20230411-0901.zip
[INFO] 
[INFO] --- maven-source-plugin:3.0.1:jar-no-fork (default) @ appng-authentication ---
[INFO] Building jar: /var/lib/jenkins/workspace/appNG_Authentication_Release/appng-authentication/target/appng-authentication-1.14.0-sources.jar
[INFO] 
[INFO] --- maven-gpg-plugin:3.0.1:sign (sign-artifacts) @ appng-authentication ---
[INFO] 
[INFO] --- maven-install-plugin:2.4:install (default-install) @ appng-authentication ---
[INFO] Installing /var/lib/jenkins/workspace/appNG_Authentication_Release/appng-authentication/target/appng-authentication-1.14.0.jar to /var/lib/jenkins/.m2/repository/org/appng/appng-authentication/1.14.0/appng-authentication-1.14.0.jar
[INFO] Installing /var/lib/jenkins/workspace/appNG_Authentication_Release/appng-authentication/pom.xml to /var/lib/jenkins/.m2/repository/org/appng/appng-authentication/1.14.0/appng-authentication-1.14.0.pom
[INFO] Installing /var/lib/jenkins/workspace/appNG_Authentication_Release/appng-authentication/target/appng-authentication-1.14.0-javadoc.jar to /var/lib/jenkins/.m2/repository/org/appng/appng-authentication/1.14.0/appng-authentication-1.14.0-javadoc.jar
[INFO] Installing /srv/www/appng.org/appng/builds/stable/appng-authentication-1.14.0-20230411-0901.zip to /var/lib/jenkins/.m2/repository/org/appng/appng-authentication/1.14.0/appng-authentication-1.14.0.zip
[INFO] Installing /var/lib/jenkins/workspace/appNG_Authentication_Release/appng-authentication/target/appng-authentication-1.14.0-sources.jar to /var/lib/jenkins/.m2/repository/org/appng/appng-authentication/1.14.0/appng-authentication-1.14.0-sources.jar
[INFO] Installing /var/lib/jenkins/workspace/appNG_Authentication_Release/appng-authentication/target/appng-authentication-1.14.0.jar.asc to /var/lib/jenkins/.m2/repository/org/appng/appng-authentication/1.14.0/appng-authentication-1.14.0.jar.asc
[INFO] Installing /var/lib/jenkins/workspace/appNG_Authentication_Release/appng-authentication/target/appng-authentication-1.14.0.pom.asc to /var/lib/jenkins/.m2/repository/org/appng/appng-authentication/1.14.0/appng-authentication-1.14.0.pom.asc
[INFO] Installing /var/lib/jenkins/workspace/appNG_Authentication_Release/appng-authentication/target/appng-authentication-1.14.0-javadoc.jar.asc to /var/lib/jenkins/.m2/repository/org/appng/appng-authentication/1.14.0/appng-authentication-1.14.0-javadoc.jar.asc
[INFO] Installing /var/lib/jenkins/workspace/appNG_Authentication_Release/appng-authentication/target/gpg/srv/www/appng.org/appng/builds/stable/appng-authentication-1.14.0-20230411-0901.zip.asc to /var/lib/jenkins/.m2/repository/org/appng/appng-authentication/1.14.0/appng-authentication-1.14.0.zip.asc
[INFO] Installing /var/lib/jenkins/workspace/appNG_Authentication_Release/appng-authentication/target/appng-authentication-1.14.0-sources.jar.asc to /var/lib/jenkins/.m2/repository/org/appng/appng-authentication/1.14.0/appng-authentication-1.14.0-sources.jar.asc
[INFO] 
[INFO] --- asciidoctor-maven-plugin:2.2.2:process-asciidoc (html) @ appng-authentication ---
[INFO] sourceDirectory /var/lib/jenkins/workspace/appNG_Authentication_Release/appng-authentication/src/docs/asciidoc does not exist
[INFO] sourceDirectory /var/lib/jenkins/workspace/appNG_Authentication_Release/appng-authentication/src/asciidoc does not exist
2023-04-11T11:02:20.841+02:00 [main] WARN FilenoUtil : Native subprocess control requires open access to the JDK IO subsystem
Pass '--add-opens java.base/sun.nio.ch=ALL-UNNAMED --add-opens java.base/java.io=ALL-UNNAMED' to enable.
[INFO] Using 'UTF-8' encoding to copy filtered resources.
[INFO] Using 'UTF-8' encoding to copy filtered properties files.
[INFO] Copying 2 resources
[INFO] Converted /var/lib/jenkins/workspace/appNG_Authentication_Release/appng-authentication/src/main/asciidoc/readme.adoc
[INFO] 
[INFO] --- asciidoctor-maven-plugin:2.2.2:process-asciidoc (pdf) @ appng-authentication ---
[INFO] sourceDirectory /var/lib/jenkins/workspace/appNG_Authentication_Release/appng-authentication/src/docs/asciidoc does not exist
[INFO] sourceDirectory /var/lib/jenkins/workspace/appNG_Authentication_Release/appng-authentication/src/asciidoc does not exist
[INFO] Using 'UTF-8' encoding to copy filtered resources.
[INFO] Using 'UTF-8' encoding to copy filtered properties files.
[INFO] Copying 2 resources
[INFO] Converted /var/lib/jenkins/workspace/appNG_Authentication_Release/appng-authentication/src/main/asciidoc/readme.adoc
[INFO] 
[INFO] --- nexus-staging-maven-plugin:1.6.7:deploy (injected-nexus-deploy) @ appng-authentication ---
[INFO] Performing local staging (local stagingDirectory="/var/lib/jenkins/workspace/appNG_Authentication_Release/appng-authentication/target/nexus-staging/staging")...
[INFO]  + Using server credentials "sonatype" from Maven settings.
[INFO] ------------------------------------------------------------------------
[INFO] BUILD FAILURE
[INFO] ------------------------------------------------------------------------
[INFO] Total time:  01:00 min
[INFO] Finished at: 2023-04-11T11:02:30+02:00
[INFO] ------------------------------------------------------------------------
[ERROR] Failed to execute goal org.sonatype.plugins:nexus-staging-maven-plugin:1.6.7:deploy (injected-nexus-deploy) on project appng-authentication: Execution injected-nexus-deploy of goal org.sonatype.plugins:nexus-staging-maven-plugin:1.6.7:deploy failed: Nexus connection problem to URL [https://oss.sonatype.org/ ]: Unable to make field private static final java.util.Map java.awt.font.TextAttribute.instanceMap accessible: module java.desktop does not "opens java.awt.font" to unnamed module @2fc07784 -> [Help 1]
[ERROR] 
[ERROR] To see the full stack trace of the errors, re-run Maven with the -e switch.
[ERROR] Re-run Maven using the -X switch to enable full debug logging.
[ERROR] 
[ERROR] For more information about the errors and possible solutions, please read the following articles:
[ERROR] [Help 1] http://cwiki.apache.org/confluence/display/MAVEN/PluginExecutionException
[Pipeline] }
[Pipeline] // dir
[Pipeline] }
[Pipeline] // stage
[Pipeline] }
[Pipeline] // node
[Pipeline] End of Pipeline
ERROR: script returned exit code 1
Finished: FAILURE